{"text_format":"1","workbook":"xlsx","n_sheets":6,"sheets":["Navigation Pane","General Input Sheet","Existing Trunk Assets - LFCF","Future Trunk Assets - LFCF","Catchment Demand - LFCF","Summary Cost Schedule"],"not_rendered":{"charts":0,"images":0,"macros":1,"external_links":0,"defined_names":30,"comments":0,"pivot_tables":0},"unopened":[],"bounds":{"document_bytes":16777216,"sheet_cells":100000,"rows_first":2000,"rows_last":500,"rows_between":2000,"halvings":0,"cell_chars":16384,"cell_head_chars":4096},"cells_cut":0,"cells_raw":0,"read":"whole","date_system":"1900"}

{"sheet":"Navigation Pane","index":0,"n_rows":21,"n_cols":18,"rows_kept":21,"cut":false,"hidden":false,"merged":[[1,1,1,15],[2,1,2,15],[3,5,3,6],[11,7,11,10],[12,7,22,10],[11,12,11,15],[9,3,9,4],[9,8,9,9],[9,13,9,14],[11,2,11,5],[12,2,12,5],[14,2,14,5],[15,2,15,5],[12,12,12,15],[7,3,8,15],[15,12,15,15],[17,2,17,5],[14,12,14,15],[22,2,22,5],[21,2,21,5],[18,2,18,5],[20,2,20,5]]}
[]
[null,"Brisbane City Council"]
[null,"Local Government Infrastructure Plan (LGIP)"]
[]
[]
[null,"Version No",null,1,null,"Date","2022-11-01",null,null,"Author ","BCC",null,null,null,null,null," "]
[]
[null,"Comments",null,"Draft LGIP 1B - Land for Community Facilities - Schedule of Works model "]
[]
[null,null,null,"Inputs",null,null,null,null,"Calculation",null,null,null,null,"Outputs"]
[]
[null,null,"General Input Sheet",null,null,null,null,"Calculation Function",null,null,null,null,"Summary Cost Schedule",null,null,null,null," "]
[null,null,"l Financial Inputs\nl Other \"generic\" inputs",null,null,null,null,"Catchment based summary of demand, infrastructure (existing and new) and cost allocation\n\nInfrastructure Cost calculation for each catchment\n\nOptional Discounted Cashflow",null,null,null,null,"l Summary of demand and cost allocation by catchment \nl Final costs by catchment",null,null,null,null," "]
[]
[null,null,null,null,null,null,null,null,null,null,null,null,"Summary Cash flow Projections"]
{"$rows_left_out":7}
{"sheet":"General Input Sheet","index":1,"n_rows":67,"n_cols":9,"rows_kept":67,"cut":false,"hidden":false,"merged":[[1,1,1,11],[3,1,3,10],[24,1,29,1],[20,1,22,1],[5,1,5,2],[15,1,15,2],[11,1,11,2]]}
[]
[null,{"$f":"'Navigation Pane'!B2","v":"Brisbane City Council"}]
["Return to Navigation Pane"]
[null,"General Input Sheet"]
[]
[null,"General Inputs",null,null,"Reference",null,"Value",null,"Comments"]
[]
[null,null,"Base Year",null,"YEAR",null,2021]
[null,null,null,null,null,null,{"$f":"YEAR","v":2021}]
[null,null,"Term (between 15 and 30 years)",null,"TERM",null,15]
[]
[null,"Application of Discounted Cash flow"]
[null,null," "]
[null,null,"Calculate charges using Discounted Cash flow? (Y/N)",null,"DCFTRIGGER",null,"Yes"]
[]
{"$rows_left_out":53}
{"sheet":"Existing Trunk Assets - LFCF","index":2,"n_rows":93,"n_cols":34,"rows_kept":93,"cut":false,"hidden":false,"merged":[[8,30,9,30],[8,31,9,31],[8,32,9,32],[8,33,9,33],[8,23,9,23],[8,24,9,24],[8,25,9,25],[8,26,9,26],[8,27,9,27],[8,29,9,29],[0,1,0,24],[1,1,1,24],[3,1,3,24],[8,22,9,22],[5,1,5,2],[7,16,7,20],[8,1,8,5],[8,6,8,7],[8,8,8,9],[8,10,8,12],[8,13,8,15],[8,16,9,16],[8,17,9,17],[8,18,9,18],[8,19,9,19],[8,20,9,20]]}
[null,{"$f":"'Navigation Pane'!B2","v":"Brisbane City Council"}]
[null,"Land for Community Facilities"]
["Return to \"Existing Trunk Assets\""]
[null,"EXISTING TRUNK ASSETS"]
[]
[null,"Land Valuation Type",null,"Location"]
[]
[null,null,null,null,null,null,null,"Asset Data",null,null,null,null,null,null,null,null,"Catchment Asset Allocation",null,null,null,null,null,null,"Asset Usage",null,null,null,null,null,null,"Cost Allocation"]
[null,"Basic Asset Data",null,null,null,null,"Asset Attributes",null,"Basic Asset Valuation",null,null,null,null,"Refined Asset Value",null,null,"Fringe","Urban East","Urban North","Urban South","Urban West",null,{"$f":"Q9","v":"Fringe"},{"$f":"R9","v":"Urban East"},{"$f":"S9","v":"Urban North"},{"$f":"T9","v":"Urban South"},{"$f":"U9","v":"Urban West"},"TOTALS",null,{"$f":"Q9","v":"Fringe"},{"$f":"R9","v":"Urban East"},{"$f":"S9","v":"Urban North"},{"$f":"T9","v":"Urban South"},{"$f":"U9","v":"Urban West"}]
[null,"Asset ID","LGIP ID","Asset Class","Service Catchment","Description","Utility allowance ($56,000/site)","Area size (m2)","Construction Unit Rate ($/m)","Construction Cost","Size of land (m2) (*)","Land Unit Rate ($/m2)","Land Value","Valuation Year","Escalation","Current Repalcement Cost","Fringe","Urban East","Urban North","Urban South","Urban West"]
[null,null,null,null,null,null,null,null,null,null,null,null,null,null,null,null,1,{"$f":"Q11+1","v":2},{"$f":"R11+1","v":3},4,5]
[null,"Councils ID (from GIS, FAR, AMA etc.)","ID from the LGIP drawings","Local/District",null,null,null,null,null,"May be calculated from unit rates OR unique values can be direct entered",null,null,null,null,null,null,{"$f":"IFERROR(VLOOKUP(Q9,Parkscatch,6,FALSE),\"\")","v":21245},331019,508114,486037,287882,null,null,null,null,null,null,null,null,{"$f":"SUM(AD13:AD92)","v":0},{"$f":"SUM(AE13:AE92)","v":73946878.701298699},{"$f":"SUM(AF13:AF92)","v":509010309.09162354},{"$f":"SUM(AG13:AG92)","v":93917782.282226384},{"$f":"SUM(AH13:AH92)","v":34607871.502978802}]
[null,"PCF192","EXIT-CF-107","District","Urban South","AUSTRALIAN PENSIONERS & SUPERANNUANTS LEAGUE QUEENSLAND",56000,800,45,{"$f":"Table156[[#This Row],[Construction Unit Rate ($/m)]]*Table156[[#This Row],[Area size (m2)]]+Table156[[#This Row],[Utility allowance ($56,000/site)]]","v":92000},800,2046.7532467532469,{"$f":"Table156[[#This Row],[Land Unit Rate ($/m2)]]*Table156[[#This Row],[Size of land (m2) (*)]]","v":1637402.5974025975},2021,{"$f":"IFERROR(('General Input Sheet'!$G$38/(VLOOKUP(N13,'General Input Sheet'!$E$38:$G$48,3,FALSE))),1)","v":1},{"$f":"J13+M13*Table156[[#This Row],[Escalation]]","v":1729402.5974025975},{"$f":"IF(Q$9=$E13,\"y\",\"\")","v":""},{"$f":"IF(R$9=$E13,\"y\",\"\")","v":""},"","y","",null,{"$f":"IF(Q13=\"y\",100%,\"\")","v":""},{"$f":"IF(R13=\"y\",100%,\"\")","v":""},"",1,"",{"$f":"SUM(W13:AA13)","v":1},null,{"$f":"IF(W13=\"\",\"\",(W13/$AB13)*$P13)","v":""},"","",1729402.5974025975,""]
[null,"PCF192","EXIT-CF-108","District","Urban South","WEST END LIBRARY",56000,800,45,{"$f":"Table156[[#This Row],[Construction Unit Rate ($/m)]]*Table156[[#This Row],[Area size (m2)]]+Table156[[#This Row],[Utility allowance ($56,000/site)]]","v":92000},800,2046.7532467532469,{"$f":"Table156[[#This Row],[Land Unit Rate ($/m2)]]*Table156[[#This Row],[Size of land (m2) (*)]]","v":1637402.5974025975},2021,{"$f":"IFERROR(('General Input Sheet'!$G$38/(VLOOKUP(N14,'General Input Sheet'!$E$38:$G$48,3,FALSE))),1)","v":1},{"$f":"J14+M14","v":1729402.5974025975},{"$f":"IF(Q$9=$E14,\"y\",\"\")","v":""},"","","y","",null,{"$f":"IF(Q14=\"y\",100%,\"\")","v":""},{"$f":"IF(R14=\"y\",100%,\"\")","v":""},{"$f":"IF(S14=\"y\",100%,\"\")","v":""},{"$f":"IF(T14=\"y\",100%,\"\")","v":1},{"$f":"IF(U14=\"y\",100%,\"\")","v":""},{"$f":"SUM(W14:AA14)","v":1},null,{"$f":"IF(W14=\"\",\"\",(W14/$AB14)*$P14)","v":""},{"$f":"IF(X14=\"\",\"\",(X14/$AB14)*$P14)","v":""},{"$f":"IF(Y14=\"\",\"\",(Y14/$AB14)*$P14)","v":""},{"$f":"IF(Z14=\"\",\"\",(Z14/$AB14)*$P14)","v":1729402.5974025975},{"$f":"IF(AA14=\"\",\"\",(AA14/$AB14)*$P14)","v":""}]
[null,"PCF53","EXIT-CF-109a","District","Urban North","Bracken Ridge Hall",56000,1300,45,{"$f":"Table156[[#This Row],[Construction Unit Rate ($/m)]]*Table156[[#This Row],[Area size (m2)]]+Table156[[#This Row],[Utility allowance ($56,000/site)]]","v":114500},1300,2046.7532467532469,{"$f":"Table156[[#This Row],[Land Unit Rate ($/m2)]]*Table156[[#This Row],[Size of land (m2) (*)]]","v":2660779.220779221},2021,{"$f":"IFERROR(('General Input Sheet'!$G$38/(VLOOKUP(N15,'General Input Sheet'!$E$38:$G$48,3,FALSE))),1)","v":1},2775279.220779221,"","","y","","",null,"","",1,"","",1,null,"","",2775279.220779221,"",""]
{"$rows_left_out":79}
{"sheet":"Future Trunk Assets - LFCF","index":3,"n_rows":28,"n_cols":53,"rows_kept":28,"cut":false,"hidden":false,"merged":[[10,41,10,45],[1,1,1,9],[2,1,2,9],[4,1,4,9],[8,1,8,2],[6,4,6,17],[6,1,6,3],[10,28,10,32],[11,43,12,43],[11,44,12,44],[11,45,12,45],[11,34,12,34],[11,35,12,35],[11,36,12,36],[11,37,12,37],[11,38,12,38],[11,39,12,39],[11,41,12,41],[11,42,12,42],[10,47,10,52],[11,52,12,52],[11,47,12,47],[11,48,12,48],[11,49,12,49],[11,50,12,50],[11,51,12,51],[11,29,12,29],[11,30,12,30],[11,31,12,31],[11,32,12,32],[11,1,11,5],[11,6,11,9],[11,10,11,16],[11,17,11,26],[11,28,12,28]]}
[]
[null,{"$f":"'Navigation Pane'!B2","v":"Brisbane City Council"}]
[null,"Parks and Land for Community Facilities"]
["Return to \"Future Trunk Assets\""]
[null,"Future Trunk Assets"]
[]
[null,"Data References",null,null,"1. Project costs are on costs to undertake detailed design, survey, geotechnical investigations, project management, and supervision of construction works and obtain certification from a Registered Professional Engineer of Queensland. Project costs equate to 23% of the direct construction costs.\n2. Contingency costs are based on the project delivery date, and applied to the direct construction cost, and project cost. Contingencies equate to 7.5% for projects with a delivery date up to 2024, 15% for projects with a delivery date up to 2029 and 20% for projects with a delivery date up to 2034.\n3. Total embellishment cost is the sum of direct embellishment cost, indirect embellishment cost, project cost and construction contingency cost. \n4. Terminal Value Adjustment is only applicable to items that have an estimated completion date between 2026 and 2036, items value exceeds 20% of the total network value in the same catchment and same year of provision, and items catchment has spare capacity greater than 30%."]
[]
[null,"Land Valuation Type",null,"Location"]
[]
[null,null,null,null,null,null,null,null,null,null,"Asset Data",null,null,null,null,null,null,null,null,null,null,null,null,null,null,null,null,null,"Catchment Asset Allocation",null,null,null,null,null,null,"Asset Usage",null,null,null,null,null,"Cost Allocation based on Net Present Value of Establishment Cost",null,null,null,null,null,"Cost Allocation for Service Cost Schedule"]
[null,"Basic Asset Data",null,null,null,null,"Land Cost Valuation",null,null,null,null,null,null,null,null,null,null,"Refined Asset Value",null,null,null,null,null,null,null,null,null,null,"Fringe","Urban East","Urban North","Urban South","Urban West",null,{"$f":"AC12","v":"Fringe"},{"$f":"AD12","v":"Urban East"},{"$f":"AE12","v":"Urban North"},{"$f":"AF12","v":"Urban South"},{"$f":"AG12","v":"Urban West"},"TOTALS",null,{"$f":"AC12","v":"Fringe"},{"$f":"AD12","v":"Urban East"},{"$f":"AE12","v":"Urban North"},{"$f":"AF12","v":"Urban South"},{"$f":"AG12","v":"Urban West"},null,{"$f":"AC12","v":"Fringe"},{"$f":"AD12","v":"Urban East"},{"$f":"AE12","v":"Urban North"},{"$f":"AF12","v":"Urban South"},{"$f":"AG12","v":"Urban West"},{"$f":"AN12","v":"TOTALS"}]
[null,"Asset ID","LGIP ID","Hierarchy/Name","Service Catchment","Description","Land Location/Type","Size of Land (m2)","Land Unit Rate ($/m2)","Land Value","Direct Construction Cost","Valuation Year","Multiplier","Construction Contingency Rate %","Construction Contingency Cost ($)","Project Owners Cost (23% Direct Construction Cost)($)","Total Construction Cost ($)","Year of Provision","Land Cost Escalation","Work Cost Escalation","Spare Capacity (%)","Share of the total Cost with the same year of provision %","Terminal Value Analysis","Terminal Value Adjustment (%)","Establishment Cost","Establishment Cost (Escalated)","Net Present Value of Establishment Cost","NPV Establishment Cost after Terminal Value Adjustment","Fringe","Urban East","Urban North","Urban South","Urban West"]
[null,"Councils ID (from GIS, FAR, AMA etc.)","ID from the LGIP drawings","Local/District Park",null,null,null,null,null,null,null,null,null,null,null,null,null,null,null,null,"Applicable to project year of provision at 2024",null,null," % of cost which is relevant for Summary Cost Calculation",null,"Gross cost (used for CF forecasts)","Adjusted Current Day Value ","For Summary Cost Calculation",null,null,null,null,null,null,null,null,null,null,null,null,null,null,null,null,null,null,null,{"$f":"SUM(AV15:AV27)","v":1304045.3355978848},{"$f":"SUM(AW15:AW27)","v":19344796.713860381},{"$f":"SUM(AX15:AX27)","v":33846801.37515381},{"$f":"SUM(AY15:AY27)","v":27797698.939172618},{"$f":"SUM(AZ15:AZ27)","v":17005367.636215311}]
[null,"PCF154","EAF-CF-001","District","Urban North","Land acquisition, basic site preparation and connection to services to provide DISTRICT COMMUNITY HUB",null,6000,{"$f":"J15/H15","v":1862.4676666666667},11174806,459210.12375610624,2021,1,{"$f":"IF(R15=\"\",\"\",IF(R15<=YEAR+5,0.075,IF(AND(R15>YEAR+5,R15<=YEAR+10),0.15,IF(AND(R15>YEAR+10,R15<=YEAR+20),0.2,IF(R15>YEAR+20,0.25,\"\")))))","v":0.15},{"$f":"(K15+P15)*N15","v":84724.21856341594},{"$f":"ROUND((K15)*23%,0)","v":105618},{"$f":"ROUND((K15+P15+(K15+P15)*N15),0)","v":649552},2029,{"$f":"Landind","v":2.0111853187589457E-2},{"$f":"PPI","v":1.8200000000000001E-2},{"$f":"IFERROR(IF(FutureTrunkParks[[#This Row],[Year of Provision]]>2024,VLOOKUP(FutureTrunkParks[[#This Row],[Service Catchment]],'Catchment Demand - LFCF'!$C$8:$M$12,11,FALSE),\"\"),\"\")","v":0.24825665082274484},{"$f":"_xlfn.IFS(FutureTrunkParks[[#This Row],[Year of Provision]]=2024,0,FutureTrunkParks[[#This Row],[Year of Provision]]=2029,FutureTrunkParks[[#This Row],[Establishment Cost]]/SUMIFS(Y$15:Y$27,R$15:R$27,2029,E$15:E$27,FutureTrunkParks[[#This Row],[Service Catchment]]),FutureTrunkParks[[#This Row],[Year of Provision]]=2034,FutureTrunkParks[[#This Row],[Establishment Cost]]/SUMIFS(Y$15:Y$27,R$15:R$27,\"2034\",E$15:E$27,FutureTrunkParks[[#This Row],[Service Catchment]]))","v":1},{"$f":"IF(AND(FutureTrunkParks[[#This Row],[Spare Capacity (%)]]>30%,FutureTrunkParks[[#This Row],[Share of the total Cost with the same year of provision %]]>20%),(1-FutureTrunkParks[[#This Row],[Spare Capacity (%)]]),1)","v":1},{"$f":"IF(FutureTrunkParks[[#This Row],[Terminal Value Analysis]]<0,0,FutureTrunkParks[[#This Row],[Terminal Value Analysis]])","v":1},{"$f":"ROUND((Q15+J15),0)","v":11824358},{"$f":"ROUND((Q15*(1+T15)^(R15-YEAR)+J15*(1+S15)^(R15-YEAR)),0)","v":13854933},{"$f":"ROUND((Z15*(1/(1+WACC))^(R15-YEAR)),0)","v":8752028},{"$f":"FutureTrunkParks[[#This Row],[Net Present Value of Establishment Cost]]*FutureTrunkParks[[#This Row],[Terminal Value Adjustment (%)]]","v":8752028},"Y","Y","Y","Y","Y",null,1.3729607286742941E-2,0.20367118739886947,0.31089128801268717,0.29266734789935012,0.17904056940235033,{"$f":"SUM(AI15:AM15)","v":1},null,{"$f":"IF(AI15=\"\",\"\",(AI15/$AN15)*$AA15)","v":120161.90740257825},{"$f":"IF(AJ15=\"\",\"\",(AJ15/$AN15)*$AA15)","v":1782535.9349081528},{"$f":"IF(AK15=\"\",\"\",(AK15/$AN15)*$AA15)","v":2720929.2576431027},{"$f":"IF(AL15=\"\",\"\",(AL15/$AN15)*$AA15)","v":2561432.8235008535},{"$f":"IF(AM15=\"\",\"\",(AM15/$AN15)*$AA15)","v":1566968.0765453135},null,{"$f":"IF(AI15=\"\",\"\",(AI15/$AN15)*$AB15)","v":120161.90740257825},{"$f":"IF(AJ15=\"\",\"\",(AJ15/$AN15)*$AB15)","v":1782535.9349081528},{"$f":"IF(AK15=\"\",\"\",(AK15/$AN15)*$AB15)","v":2720929.2576431027},{"$f":"IF(AL15=\"\",\"\",(AL15/$AN15)*$AB15)","v":2561432.8235008535},{"$f":"IF(AM15=\"\",\"\",(AM15/$AN15)*$AB15)","v":1566968.0765453135},{"$f":"SUM(AV15:AZ15)","v":8752028}]
{"$rows_left_out":14}
{"sheet":"Catchment Demand - LFCF","index":4,"n_rows":47,"n_cols":24,"rows_kept":47,"cut":false,"hidden":false,"merged":[[1,1,1,11],[2,1,2,11],[4,1,4,11]]}
[]
[null,{"$f":"'Navigation Pane'!B2","v":"Brisbane City Council"}]
[null,"Land for Community Facilities"]
["Return to \"Catchment Demand\""]
[null,"Catchment Demand(equivalent persons)"]
[]
[null,"Catchment No","Catchment Name (*)",2021,2026,2031,2036,2041,null,{"$f":"\"NPV Future Demand (\"&(D7+1)& \" - \" &G7&\")\"","v":"NPV Future Demand (2022 - 2036)"},null,{"$f":" \"Ultimate Demand\"","v":"Ultimate Demand"},"Spare Capacity"]
[null,1,"Fringe",20937,20814,20639,21323,21245,null,{"$f":"NPV(5.91%,E43:S43)","v":110.52772693513626},null,21928,{"$f":"(L8-G8)/G8","v":2.8373118229142239E-2}]
[null,2,"Urban East",281926,291638,301216,316315,331019,null,{"$f":"NPV(5.91%,E44:S44)","v":21453.687649975127},null,383889,{"$f":"(L9-G9)/G9","v":0.21362881937309328}]
[null,3,"Urban North",396666,429284,456967,482835,508114,null,57395.040332076213,null,602702,0.24825665082274484]
[null,4,"Urban South",385242,404589,426593,454532,486037,null,43572.935734573439,null,555432,0.22198657080249576]
[null,5,"Urban West",255491,262389,268953,278062,287882,null,14318.056580818058,null,315673,0.13526120073940345]
[]
[]
[]
{"$rows_left_out":33}
{"sheet":"Summary Cost Schedule","index":5,"n_rows":15,"n_cols":10,"rows_kept":15,"cut":false,"hidden":false,"merged":[[8,1,8,9],[1,1,1,9],[2,1,2,9],[4,1,4,9],[6,3,6,5],[6,6,6,8],[6,1,6,2],[6,9,7,9]]}
[]
[null,{"$f":"'Navigation Pane'!B2","v":"Brisbane City Council"}]
[]
["Return to Navigation Pane"]
[null,"Summary Cost Schedule"]
[]
[null,"Catchment",null,"Demand",null,null,"Cost of Trunk Infrastrcutrue ",null,null,"Cost per Unit Demand (Average)"]
[null,"No","Name","Existing (A)","NPV Future (B)","TOTAL (A)+ (B)","Existing (C)","NPV Future (D)","TOTAL (C)+ (D)"]
[null,"Land for Community Facilities"]
[null,{"$f":"'Catchment Demand - LFCF'!B43","v":1},{"$f":"'Catchment Demand - LFCF'!C43","v":"Fringe"},{"$f":"IFERROR(VLOOKUP($C10,'Catchment Demand - LFCF'!$C$8:$J$37,2,FALSE),\"\")","v":20937},{"$f":"IFERROR(VLOOKUP($C10,'Catchment Demand - LFCF'!$C$8:$J$37,8,FALSE),\"\")","v":110.52772693513626},{"$f":"IFERROR(D10+E10,\"\")","v":21047.527726935135},{"$f":"HLOOKUP(C10,'Existing Trunk Assets - LFCF'!$AD$9:$AH$12,4,FALSE)","v":0},{"$f":"HLOOKUP(C10,'Future Trunk Assets - LFCF'!$AV$12:$AZ$14,3,FALSE)","v":1304045.3355978848},{"$f":"G10+H10","v":1304045.3355978848},{"$f":"IFERROR(I10/F10,0)","v":61.957173902617548}]
[null,{"$f":"'Catchment Demand - LFCF'!B44","v":2},{"$f":"'Catchment Demand - LFCF'!C44","v":"Urban East"},{"$f":"IFERROR(VLOOKUP($C11,'Catchment Demand - LFCF'!$C$8:$J$37,2,FALSE),\"\")","v":281926},{"$f":"IFERROR(VLOOKUP($C11,'Catchment Demand - LFCF'!$C$8:$J$37,8,FALSE),\"\")","v":21453.687649975127},{"$f":"IFERROR(D11+E11,\"\")","v":303379.68764997512},{"$f":"HLOOKUP(C11,'Existing Trunk Assets - LFCF'!$AD$9:$AH$12,4,FALSE)","v":73946878.701298699},{"$f":"HLOOKUP(C11,'Future Trunk Assets - LFCF'!$AV$12:$AZ$14,3,FALSE)","v":19344796.713860381},{"$f":"G11+H11","v":93291675.415159076},{"$f":"IFERROR(I11/F11,0)","v":307.50798162464497}]
[null,{"$f":"'Catchment Demand - LFCF'!B45","v":3},{"$f":"'Catchment Demand - LFCF'!C45","v":"Urban North"},{"$f":"IFERROR(VLOOKUP($C12,'Catchment Demand - LFCF'!$C$8:$J$37,2,FALSE),\"\")","v":396666},{"$f":"IFERROR(VLOOKUP($C12,'Catchment Demand - LFCF'!$C$8:$J$37,8,FALSE),\"\")","v":57395.040332076213},454061.0403320762,{"$f":"HLOOKUP(C12,'Existing Trunk Assets - LFCF'!$AD$9:$AH$12,4,FALSE)","v":509010309.09162354},{"$f":"HLOOKUP(C12,'Future Trunk Assets - LFCF'!$AV$12:$AZ$14,3,FALSE)","v":33846801.37515381},542857110.46677732,1195.5597645412615]
[null,{"$f":"'Catchment Demand - LFCF'!B46","v":4},{"$f":"'Catchment Demand - LFCF'!C46","v":"Urban South"},{"$f":"IFERROR(VLOOKUP($C13,'Catchment Demand - LFCF'!$C$8:$J$37,2,FALSE),\"\")","v":385242},{"$f":"IFERROR(VLOOKUP($C13,'Catchment Demand - LFCF'!$C$8:$J$37,8,FALSE),\"\")","v":43572.935734573439},428814.93573457346,{"$f":"HLOOKUP(C13,'Existing Trunk Assets - LFCF'!$AD$9:$AH$12,4,FALSE)","v":93917782.282226384},{"$f":"HLOOKUP(C13,'Future Trunk Assets - LFCF'!$AV$12:$AZ$14,3,FALSE)","v":27797698.939172618},121715481.22139901,283.84151548475467]
[null,{"$f":"'Catchment Demand - LFCF'!B47","v":5},{"$f":"'Catchment Demand - LFCF'!C47","v":"Urban West"},{"$f":"IFERROR(VLOOKUP($C14,'Catchment Demand - LFCF'!$C$8:$J$37,2,FALSE),\"\")","v":255491},{"$f":"IFERROR(VLOOKUP($C14,'Catchment Demand - LFCF'!$C$8:$J$37,8,FALSE),\"\")","v":14318.056580818058},269809.05658081808,{"$f":"HLOOKUP(C14,'Existing Trunk Assets - LFCF'!$AD$9:$AH$12,4,FALSE)","v":34607871.502978802},{"$f":"HLOOKUP(C14,'Future Trunk Assets - LFCF'!$AV$12:$AZ$14,3,FALSE)","v":17005367.636215311},51613239.139194116,191.29542867562708]
[null,null,"Totals",{"$f":"SUM(D10:D14)","v":1340262},136850.24802437797,1477112.248024378,711482841.57812738,99298710.000000015,810781551.5781275,2040.1618642289059]